Reaction Details
TargetNociceptin receptor
LigandBDBM50296591
Substrate/Competitorn/a
Meas. Tech.ChEMBL_582239 (CHEMBL1059899)
IC50 33±n/a nM
Citation Kobayashi, KTsujita, TIto, HOzaki, STani, TIshii, YOkuda, STadano, KFukuroda, TOhta, HOkamoto, O Identification of MK-1925: a selective, orally active and brain-penetrable opioid receptor-like 1 (ORL1) antagonist. Bioorg Med Chem Lett19:4729-32 (2009) 
 
Nociceptin receptor
Name:Nociceptin receptor
Type:G Protein-Coupled Receptor (GPCR)
Mol. Mass.:40702.87
Organism:Homo sapiens (Human)
Description:P41146
Residue:370
BDBM50296591
NameBDBM50296591
Synonyms:(1S,3R)-N-((5-(3,5-difluorophenyl)-4-methyl-1-(2-(methylsulfonyl)ethyl)-1H-pyrazol-3-yl)methyl)-3-fluorocyclopentanamine | CHEMBL560469
TypeSmall organic molecule
Emp. Form.C19H24F3N3O2S
Mol. Mass.415.473
SMILESCc1c(CN[C@H]2CC[C@@H](F)C2)nn(CCS(C)(=O)=O)c1-c1cc(F)cc(F)c1