Reaction Details
TargetNociceptin receptor
LigandBDBM29986
Substrate/Competitorn/a
Meas. Tech.ChEMBL_582239 (CHEMBL1059899)
IC50 0.310000±n/a nM
Citation Kobayashi, KTsujita, TIto, HOzaki, STani, TIshii, YOkuda, STadano, KFukuroda, TOhta, HOkamoto, O Identification of MK-1925: a selective, orally active and brain-penetrable opioid receptor-like 1 (ORL1) antagonist. Bioorg Med Chem Lett19:4729-32 (2009) 
 
Nociceptin receptor
Name:Nociceptin receptor
Type:G Protein-Coupled Receptor (GPCR)
Mol. Mass.:40702.87
Organism:Homo sapiens (Human)
Description:P41146
Residue:370
BDBM29986
NameBDBM29986
Synonyms:arylpyrazole, 31
TypeSmall organic molecule
Emp. Form.C21H22ClF2N5
Mol. Mass.417.883
SMILESCc1c(CN[C@H]2CC[C@@H](F)C2)nn(c1-c1cnc(C)c(F)c1)-c1ncccc1Cl