Reaction Details
TargetNociceptin receptor
LigandBDBM50296581
Substrate/Competitorn/a
Meas. Tech.ChEMBL_582239 (CHEMBL1059899)
IC50 0.610000±n/a nM
Citation Kobayashi, KTsujita, TIto, HOzaki, STani, TIshii, YOkuda, STadano, KFukuroda, TOhta, HOkamoto, O Identification of MK-1925: a selective, orally active and brain-penetrable opioid receptor-like 1 (ORL1) antagonist. Bioorg Med Chem Lett19:4729-32 (2009) 
 
Nociceptin receptor
Name:Nociceptin receptor
Type:G Protein-Coupled Receptor (GPCR)
Mol. Mass.:40702.87
Organism:Homo sapiens (Human)
Description:P41146
Residue:370
BDBM50296581
NameBDBM50296581
Synonyms:(1S,3R)-N-((1-ethyl-5-(5-fluoro-6-methylpyridin-3-yl)-4-methyl-1H-pyrazol-3-yl)methyl)-3-fluorocyclopentanamine | CHEMBL557623
TypeSmall organic molecule
Emp. Form.C18H24F2N4
Mol. Mass.334.4068
SMILESCCn1nc(CN[C@H]2CC[C@@H](F)C2)c(C)c1-c1cnc(C)c(F)c1