Reaction Details
TargetIntegrin alpha-V
LigandBDBM50296603
Substrate/Competitorn/a
Meas. Tech.ChEMBL_582336 (CHEMBL1053400)
IC50 25±n/a nM
Citation Elliot, DHenshaw, EMacFaul, PAMorley, ADNewham, POldham, KPage, KRankine, NSharpe, PTing, AWood, CM Novel inhibitors of the alphavbeta3 integrin--lead identification strategy. Bioorg Med Chem Lett19:4832-5 (2009) 
 
Integrin alpha-V
Name:Integrin alpha-V
Type:PROTEIN
Mol. Mass.:116024.92
Organism:Homo sapiens (Human)
Description:ChEMBL_582336
Residue:1048
BDBM50296603
NameBDBM50296603
Synonyms:(R)-3-benzamido-2-(2-iodophenylsulfonamido)propanoic acid | CHEMBL559542
TypeSmall organic molecule
Emp. Form.C16H15IN2O5S
Mol. Mass.474.27
SMILESOC(=O)[C@@H](CNC(=O)c1ccccc1)NS(=O)(=O)c1ccccc1I