Reaction Details
TargetIntegrin alpha-V
LigandBDBM50296607
Substrate/Competitorn/a
Meas. Tech.ChEMBL_582336 (CHEMBL1053400)
IC50 63±n/a nM
Citation Elliot, DHenshaw, EMacFaul, PAMorley, ADNewham, POldham, KPage, KRankine, NSharpe, PTing, AWood, CM Novel inhibitors of the alphavbeta3 integrin--lead identification strategy. Bioorg Med Chem Lett19:4832-5 (2009) 
 
Integrin alpha-V
Name:Integrin alpha-V
Type:PROTEIN
Mol. Mass.:116024.92
Organism:Homo sapiens (Human)
Description:ChEMBL_582336
Residue:1048
BDBM50296607
NameBDBM50296607
Synonyms:(R)-3-(pyrimidine-5-carboxamido)-2-(2,4,6-trimethylphenylsulfonamido)propanoic acid | CHEMBL558131
TypeSmall organic molecule
Emp. Form.C17H20N4O5S
Mol. Mass.392.429
SMILESCc1cc(C)c(c(C)c1)S(=O)(=O)N[C@H](CNC(=O)c1cncnc1)C(O)=O