Reaction Details
TargetCalcitonin gene-related peptide type 1 receptor
LigandBDBM50296784
Substrate/Competitorn/a
Meas. Tech.ChEMBL_582534 (CHEMBL1060867)
Ki 0.23±n/a nM
Citation Bell, IMBednar, RACorcoran, HAFay, JFGallicchio, SNJohnston, VKHershey, JCMiller-Stein, CMMoore, ELMosser, SDRoller, SASalvatore, CATheberge, CRWong, BKBlair Zartman, CKane, SAWilliams, TMGraham, SLVacca, JP The identification of potent, orally bioavailable tricyclic CGRP receptor antagonists. Bioorg Med Chem Lett19:4740-2 (2009) 
 
Calcitonin gene-related peptide type 1 receptor
Name:Calcitonin gene-related peptide type 1 receptor
Type:Enzyme Catalytic Domain
Mol. Mass.:52980.45
Organism:Homo sapiens (Human)
Description:Q16602
Residue:461
BDBM50296784
NameBDBM50296784
Synonyms:(S)-2-(6-methyl-2,5-dioxo-2,4,5,6-tetrahydro-1H-imidazo[1,5,4-de]quinoxalin-1-yl)-N-(2'-oxo-1,1',2',3-tetrahydrospiro[indene-2,3'-pyrrolo[2,3-b]pyridine]-5-yl)acetamide | CHEMBL560527
TypeSmall organic molecule
Emp. Form.C27H22N6O4
Mol. Mass.494.5014
SMILESCN1C(=O)Cn2c3c1cccc3n(CC(=O)Nc1ccc3C[C@@]4(Cc3c1)C(=O)Nc1ncccc41)c2=O