Reaction Details
TargetCalcitonin gene-related peptide type 1 receptor
LigandBDBM50296785
Substrate/Competitorn/a
Meas. Tech.ChEMBL_582536 (CHEMBL1060869)
IC50 2±n/a nM
Citation Bell, IMBednar, RACorcoran, HAFay, JFGallicchio, SNJohnston, VKHershey, JCMiller-Stein, CMMoore, ELMosser, SDRoller, SASalvatore, CATheberge, CRWong, BKBlair Zartman, CKane, SAWilliams, TMGraham, SLVacca, JP The identification of potent, orally bioavailable tricyclic CGRP receptor antagonists. Bioorg Med Chem Lett19:4740-2 (2009) 
 
Calcitonin gene-related peptide type 1 receptor
Name:Calcitonin gene-related peptide type 1 receptor
Type:Enzyme Catalytic Domain
Mol. Mass.:52980.45
Organism:Homo sapiens (Human)
Description:Q16602
Residue:461
BDBM50296785
NameBDBM50296785
Synonyms:(S)-N-(2'-oxo-1,1',2',3-tetrahydrospiro[indene-2,3'-pyrrolo[2,3-b]pyridine]-5-yl)-2-(2-oxo-2,3-dihydropyrrolo[4,3,2-de]quinolin-5(1H)-yl)acetamide | CHEMBL562069
TypeSmall organic molecule
Emp. Form.C27H21N5O3
Mol. Mass.463.4873
SMILESO=C(Cn1cc2CC(=O)Nc3cccc1c23)Nc1ccc2C[C@@]3(Cc2c1)C(=O)Nc1ncccc31