Reaction Details
TargetCalcitonin gene-related peptide type 1 receptor
LigandBDBM50296786
Substrate/Competitorn/a
Meas. Tech.ChEMBL_582534 (CHEMBL1060867)
Ki 1.4±n/a nM
Citation Bell, IMBednar, RACorcoran, HAFay, JFGallicchio, SNJohnston, VKHershey, JCMiller-Stein, CMMoore, ELMosser, SDRoller, SASalvatore, CATheberge, CRWong, BKBlair Zartman, CKane, SAWilliams, TMGraham, SLVacca, JP The identification of potent, orally bioavailable tricyclic CGRP receptor antagonists. Bioorg Med Chem Lett19:4740-2 (2009) 
 
Calcitonin gene-related peptide type 1 receptor
Name:Calcitonin gene-related peptide type 1 receptor
Type:Enzyme Catalytic Domain
Mol. Mass.:52980.45
Organism:Homo sapiens (Human)
Description:Q16602
Residue:461
BDBM50296786
NameBDBM50296786
Synonyms:(S)-2-(1-methyl-2-oxo-2,3-dihydropyrrolo[4,3,2-de]quinolin-5(1H)-yl)-N-(2'-oxo-1,1',2',3-tetrahydrospiro[indene-2,3'-pyrrolo[2,3-b]pyridine]-5-yl)acetamide | CHEMBL563727
TypeSmall organic molecule
Emp. Form.C28H23N5O3
Mol. Mass.477.5139
SMILESCN1C(=O)Cc2cn(CC(=O)Nc3ccc4C[C@@]5(Cc4c3)C(=O)Nc3ncccc53)c3cccc1c23