Reaction Details
TargetProstaglandin D2 receptor 2
LigandBDBM50296847
Substrate/Competitorn/a
Meas. Tech.ChEMBL_582681 (CHEMBL1051055)
Ki 43±n/a nM
Citation Sandham, DAAdcock, CBala, KBarker, LBrown, ZDubois, GBudd, DCox, BFairhurst, RAFuregati, MLeblanc, CManini, JProfit, RReilly, JStringer, RSchmidt, ATurner, KLWatson, SJWillis, JWilliams, GWilson, C 7-Azaindole-3-acetic acid derivatives: potent and selective CRTh2 receptor antagonists. Bioorg Med Chem Lett19:4794-8 (2009) 
 
Prostaglandin D2 receptor 2
Name:Prostaglandin D2 receptor 2
Type:Enzyme
Mol. Mass.:43295.45
Organism:Homo sapiens (Human)
Description:Q9Y5Y4
Residue:395
BDBM50296847
NameBDBM50296847
Synonyms:2-(1-(4-cyano-3-ethoxyphenylsulfonyl)-2-methyl-1H-pyrrolo[2,3-b]pyridin-3-yl)acetic acid | CHEMBL557662
TypeSmall organic molecule
Emp. Form.C19H17N3O5S
Mol. Mass.399.42
SMILESCCOc1cc(ccc1C#N)S(=O)(=O)n1c(C)c(CC(O)=O)c2cccnc12