Reaction Details
TargetSodium-dependent serotonin transporter
LigandBDBM50296872
Substrate/Competitorn/a
Meas. Tech.ChEMBL_580516 (CHEMBL1053230)
IC50 17±n/a nM
Citation Cho, KAndo, MKobayashi, KMiyazoe, HTsujino, TIto, SSuzuki, TTanaka, TTokita, SSato, N Design, synthesis and evaluation of a novel cyclohexanamine class of neuropeptide Y Y1 receptor antagonists. Bioorg Med Chem Lett19:4781-5 (2009) 
 
Sodium-dependent serotonin transporter
Name:Sodium-dependent serotonin transporter
Type:Multi-pass membrane protein
Mol. Mass.:70322.51
Organism:Homo sapiens (Human)
Description:P31645
Residue:630
BDBM50296872
NameBDBM50296872
Synonyms:3-(1-((1R,4R)-4-((R)-1-(4-methoxyphenyl)ethylamino)-2,2-dimethylcyclohexanecarbonyl)-4-phenylpiperidin-4-yl)-1,3-oxazinan-2-one | CHEMBL561332
TypeSmall organic molecule
Emp. Form.C33H45N3O4
Mol. Mass.547.7281
SMILESCOc1ccc(cc1)[C@@H](C)N[C@@H]1CC[C@@H](C(=O)N2CCC(CC2)(N2CCCOC2=O)c2ccccc2)C(C)(C)C1