Reaction Details
TargetPotassium voltage-gated channel subfamily H member 2
LigandBDBM50296886
Substrate/Competitorn/a
Meas. Tech.ChEMBL_580515 (CHEMBL1053229)
IC50>10000±n/a nM
Citation Cho, KAndo, MKobayashi, KMiyazoe, HTsujino, TIto, SSuzuki, TTanaka, TTokita, SSato, N Design, synthesis and evaluation of a novel cyclohexanamine class of neuropeptide Y Y1 receptor antagonists. Bioorg Med Chem Lett19:4781-5 (2009) 
 
Potassium voltage-gated channel subfamily H member 2
Name:Potassium voltage-gated channel subfamily H member 2
Type:Multi-pass membrane protein
Mol. Mass.:126672.65
Organism:Homo sapiens (Human)
Description:Q12809
Residue:1159
BDBM50296886
NameBDBM50296886
Synonyms:(1-((1R,4R)-4-((R)-1-(3-methoxyphenyl)ethylamino)-2,2-dimethylcyclohexanecarbonyl)-4-phenylpiperidin-4-yl)(pyrrolidin-1-yl)methanone | CHEMBL562532
TypeSmall organic molecule
Emp. Form.C34H47N3O3
Mol. Mass.545.7553
SMILESCOc1cccc(c1)[C@@H](C)N[C@@H]1CC[C@@H](C(=O)N2CCC(CC2)(C(=O)N2CCCC2)c2ccccc2)C(C)(C)C1