Reaction Details
TargetNeuropeptide Y receptor type 1
LigandBDBM50296881
Substrate/Competitorn/a
Meas. Tech.ChEMBL_580514 (CHEMBL1053228)
Ki 22±n/a nM
Citation Cho, KAndo, MKobayashi, KMiyazoe, HTsujino, TIto, SSuzuki, TTanaka, TTokita, SSato, N Design, synthesis and evaluation of a novel cyclohexanamine class of neuropeptide Y Y1 receptor antagonists. Bioorg Med Chem Lett19:4781-5 (2009) 
 
Neuropeptide Y receptor type 1
Name:Neuropeptide Y receptor type 1
Type:Enzyme Catalytic Domain
Mol. Mass.:44399.07
Organism:Homo sapiens (Human)
Description:NPY-Y1 NPY1R HUMAN::P25929
Residue:384
BDBM50296881
NameBDBM50296881
Synonyms:(1-((1R,4R)-4-((S)-2,2-difluoro-1-(4-methoxyphenyl)ethylamino)-2,2-dimethylcyclohexanecarbonyl)-4-phenylpiperidin-4-yl)(pyrrolidin-1-yl)methanone | CHEMBL540466
TypeSmall organic molecule
Emp. Form.C34H45F2N3O3
Mol. Mass.581.7362
SMILESCOc1ccc(cc1)[C@H](N[C@@H]1CC[C@@H](C(=O)N2CCC(CC2)(C(=O)N2CCCC2)c2ccccc2)C(C)(C)C1)C(F)F