Reaction Details
TargetNeuropeptide Y receptor type 1
LigandBDBM50296889
Substrate/Competitorn/a
Meas. Tech.ChEMBL_580514 (CHEMBL1053228)
Ki 470±n/a nM
Citation Cho, KAndo, MKobayashi, KMiyazoe, HTsujino, TIto, SSuzuki, TTanaka, TTokita, SSato, N Design, synthesis and evaluation of a novel cyclohexanamine class of neuropeptide Y Y1 receptor antagonists. Bioorg Med Chem Lett19:4781-5 (2009) 
 
Neuropeptide Y receptor type 1
Name:Neuropeptide Y receptor type 1
Type:Enzyme Catalytic Domain
Mol. Mass.:44399.07
Organism:Homo sapiens (Human)
Description:NPY-Y1 NPY1R HUMAN::P25929
Residue:384
BDBM50296889
NameBDBM50296889
Synonyms:(1-((1R,4R)-4-(4-methoxybenzylamino)-2,2-dimethylcyclohexanecarbonyl)-4-phenylpiperidin-4-yl)(pyrrolidin-1-yl)methanone | CHEMBL557932
TypeSmall organic molecule
Emp. Form.C33H45N3O3
Mol. Mass.531.7287
SMILESCOc1ccc(CN[C@@H]2CC[C@@H](C(=O)N3CCC(CC3)(C(=O)N3CCCC3)c3ccccc3)C(C)(C)C2)cc1