Reaction Details
TargetNeuropeptide Y receptor type 1
LigandBDBM50296892
Substrate/Competitorn/a
Meas. Tech.ChEMBL_580514 (CHEMBL1053228)
Ki 3000±n/a nM
Citation Cho, KAndo, MKobayashi, KMiyazoe, HTsujino, TIto, SSuzuki, TTanaka, TTokita, SSato, N Design, synthesis and evaluation of a novel cyclohexanamine class of neuropeptide Y Y1 receptor antagonists. Bioorg Med Chem Lett19:4781-5 (2009) 
 
Neuropeptide Y receptor type 1
Name:Neuropeptide Y receptor type 1
Type:Enzyme Catalytic Domain
Mol. Mass.:44399.07
Organism:Homo sapiens (Human)
Description:NPY-Y1 NPY1R HUMAN::P25929
Residue:384
BDBM50296892
NameBDBM50296892
Synonyms:((1R,4R)-4-((R)-1-(4-methoxyphenyl)ethylamino)-2,2-dimethylcyclohexyl)(4'-phenyl-1,4'-bipiperidin-1'-yl)methanone | CHEMBL561594
TypeSmall organic molecule
Emp. Form.C34H49N3O2
Mol. Mass.531.7718
SMILESCOc1ccc(cc1)[C@@H](C)N[C@@H]1CC[C@@H](C(=O)N2CCC(CC2)(N2CCCCC2)c2ccccc2)C(C)(C)C1