Reaction Details
TargetNociceptin receptor
LigandBDBM50296911
Substrate/Competitorn/a
Meas. Tech.ChEMBL_580798 (CHEMBL1059780)
IC50 3.7±n/a nM
Citation Sugimoto, YKobayashi, KAsai, MOhno, AYamada, KOzaki, SOhta, HOkamoto, O Synthesis and biological evaluation of imidazole derivatives as novel NOP/ORL1 receptor antagonists: exploration and optimization of alternative pyrazole structure. Bioorg Med Chem Lett19:4611-6 (2009) 
 
Nociceptin receptor
Name:Nociceptin receptor
Type:G Protein-Coupled Receptor (GPCR)
Mol. Mass.:40702.87
Organism:Homo sapiens (Human)
Description:P41146
Residue:370
BDBM50296911
NameBDBM50296911
Synonyms:(1S,3R)-N-((2-(3-chloropyridin-2-yl)-5-methyl-1-(6-methylpyridin-3-yl)-1H-imidazol-4-yl)methyl)-3-fluorocyclopentanamine | CHEMBL551208
TypeSmall organic molecule
Emp. Form.C21H23ClFN5
Mol. Mass.399.892
SMILESCc1c(CN[C@H]2CC[C@@H](F)C2)nc(-c2ncccc2Cl)n1-c1ccc(C)nc1