Reaction Details
TargetNociceptin receptor
LigandBDBM50296915
Substrate/Competitorn/a
Meas. Tech.ChEMBL_580798 (CHEMBL1059780)
IC50 4.5±n/a nM
Citation Sugimoto, YKobayashi, KAsai, MOhno, AYamada, KOzaki, SOhta, HOkamoto, O Synthesis and biological evaluation of imidazole derivatives as novel NOP/ORL1 receptor antagonists: exploration and optimization of alternative pyrazole structure. Bioorg Med Chem Lett19:4611-6 (2009) 
 
Nociceptin receptor
Name:Nociceptin receptor
Type:G Protein-Coupled Receptor (GPCR)
Mol. Mass.:40702.87
Organism:Homo sapiens (Human)
Description:P41146
Residue:370
BDBM50296915
NameBDBM50296915
Synonyms:(1S,3R)-N-((1-(3,5-difluorophenyl)-5-isopropyl-2-methyl-1H-imidazol-4-yl)methyl)-3-fluorocyclopentanamine | CHEMBL556300
TypeSmall organic molecule
Emp. Form.C19H24F3N3
Mol. Mass.351.4092
SMILESCC(C)c1c(CN[C@H]2CC[C@@H](F)C2)nc(C)n1-c1cc(F)cc(F)c1