Reaction Details
TargetRAC-beta serine/threonine-protein kinase
LigandBDBM15211
Substrate/Competitorn/a
Meas. Tech.ChEMBL_580808 (CHEMBL1061586)
IC50 300±n/a nM
Citation Medina-Franco, JLGiulianotti, MAYu, YShen, LYao, LSingh, N Discovery of a novel protein kinase B inhibitor by structure-based virtual screening. Bioorg Med Chem Lett19:4634-8 (2009) 
 
RAC-beta serine/threonine-protein kinase
Name:RAC-beta serine/threonine-protein kinase
Type:Enzyme
Mol. Mass.:55766.64
Organism:Homo sapiens (Human)
Description:n/a
Residue:481
BDBM15211
NameBDBM15211
Synonyms:CHEMBL104264 H89 N-(2-{[(2E)-3-(4-bromophenyl)prop-2-en-1-yl]amino}ethyl)isoquinoline-5-sulfonamide | N-[2-[[(E)-3-(4-bromophenyl)prop-2-enyl]amino]ethyl]isoquinoline-5-sulfonamide
TypeSmall organic molecule
Emp. Form.C20H20BrN3O2S
Mol. Mass.446.361
SMILESBrc1ccc(\C=C\CNCCNS(=O)(=O)c2cccc3cnccc23)cc1