Reaction Details
TargetPotassium voltage-gated channel subfamily H member 2
LigandBDBM50296933
Substrate/Competitorn/a
Meas. Tech.ChEMBL_580850 (CHEMBL1064182)
Ki 20000±n/a nM
Citation Mitchell, HJDankulich, WPHartman, GDPrueksaritanont, TSchmidt, AVogel, RLBai, CMcElwee-Witmer, SZhang, HZChen, FLeu, CTKimmel, DBRay, WJNantermet, PGentile, MADuggan, MEMeissner, RS Design, synthesis, and biological evaluation of 16-substituted 4-azasteroids as tissue-selective androgen receptor modulators (SARMs). J Med Chem52:4578-81 (2009) 
 
Potassium voltage-gated channel subfamily H member 2
Name:Potassium voltage-gated channel subfamily H member 2
Type:Multi-pass membrane protein
Mol. Mass.:126672.65
Organism:Homo sapiens (Human)
Description:Q12809
Residue:1159
BDBM50296933
NameBDBM50296933
Synonyms:16alpha-(Methyl)-17beta-hydroxy-4-methyl-4-aza-5alpha-androst-1-en-3-one | CHEMBL538137
TypeSmall organic molecule
Emp. Form.C20H31NO2
Mol. Mass.317.4656
SMILESC[C@@H]1C[C@H]2[C@@H]3CC[C@H]4N(C)C(=O)C=C[C@]4(C)[C@H]3CC[C@]2(C)[C@H]1O