Reaction Details
TargetPotassium voltage-gated channel subfamily H member 2
LigandBDBM50296939
Substrate/Competitorn/a
Meas. Tech.ChEMBL_580850 (CHEMBL1064182)
Ki 8050±n/a nM
Citation Mitchell, HJDankulich, WPHartman, GDPrueksaritanont, TSchmidt, AVogel, RLBai, CMcElwee-Witmer, SZhang, HZChen, FLeu, CTKimmel, DBRay, WJNantermet, PGentile, MADuggan, MEMeissner, RS Design, synthesis, and biological evaluation of 16-substituted 4-azasteroids as tissue-selective androgen receptor modulators (SARMs). J Med Chem52:4578-81 (2009) 
 
Potassium voltage-gated channel subfamily H member 2
Name:Potassium voltage-gated channel subfamily H member 2
Type:Multi-pass membrane protein
Mol. Mass.:126672.65
Organism:Homo sapiens (Human)
Description:Q12809
Residue:1159
BDBM50296939
NameBDBM50296939
Synonyms:16-(Methylmethylidene)-17beta-hydroxy-4-methyl-4-aza-5alpha-androst-1-en-3-one | CHEMBL557116
TypeSmall organic molecule
Emp. Form.C21H31NO2
Mol. Mass.329.4763
SMILESC\C=C1/C[C@H]2[C@@H]3CC[C@H]4N(C)C(=O)C=C[C@]4(C)[C@H]3CC[C@]2(C)[C@H]1O