Reaction Details
TargetPotassium voltage-gated channel subfamily H member 2
LigandBDBM50296941
Substrate/Competitorn/a
Meas. Tech.ChEMBL_580850 (CHEMBL1064182)
Ki 320±n/a nM
Citation Mitchell, HJDankulich, WPHartman, GDPrueksaritanont, TSchmidt, AVogel, RLBai, CMcElwee-Witmer, SZhang, HZChen, FLeu, CTKimmel, DBRay, WJNantermet, PGentile, MADuggan, MEMeissner, RS Design, synthesis, and biological evaluation of 16-substituted 4-azasteroids as tissue-selective androgen receptor modulators (SARMs). J Med Chem52:4578-81 (2009) 
 
Potassium voltage-gated channel subfamily H member 2
Name:Potassium voltage-gated channel subfamily H member 2
Type:Multi-pass membrane protein
Mol. Mass.:126672.65
Organism:Homo sapiens (Human)
Description:Q12809
Residue:1159
BDBM50296941
NameBDBM50296941
Synonyms:16-(Pyridin-4-ylmethylidene)-17beta-hydroxy-4-methyl-4-aza-5alpha-androst-1-en-3-one | CHEMBL556848
TypeSmall organic molecule
Emp. Form.C25H32N2O2
Mol. Mass.392.5338
SMILESCN1[C@@H]2CC[C@H]3[C@@H]4C\C(=C/c5ccncc5)[C@H](O)[C@@]4(C)CC[C@@H]3[C@@]2(C)C=CC1=O