Reaction Details
TargetPotassium voltage-gated channel subfamily H member 2
LigandBDBM50296947
Substrate/Competitorn/a
Meas. Tech.ChEMBL_580850 (CHEMBL1064182)
Ki 22500±n/a nM
Citation Mitchell, HJDankulich, WPHartman, GDPrueksaritanont, TSchmidt, AVogel, RLBai, CMcElwee-Witmer, SZhang, HZChen, FLeu, CTKimmel, DBRay, WJNantermet, PGentile, MADuggan, MEMeissner, RS Design, synthesis, and biological evaluation of 16-substituted 4-azasteroids as tissue-selective androgen receptor modulators (SARMs). J Med Chem52:4578-81 (2009) 
 
Potassium voltage-gated channel subfamily H member 2
Name:Potassium voltage-gated channel subfamily H member 2
Type:Multi-pass membrane protein
Mol. Mass.:126672.65
Organism:Homo sapiens (Human)
Description:Q12809
Residue:1159
BDBM50296947
NameBDBM50296947
Synonyms:16-{[(2-Methylamino)pyrimidin-5-yl]methylidene}-17beta-hydroxy-4-methyl-4-aza-5alpha-androst-1-en-3-one | CHEMBL563597
TypeSmall organic molecule
Emp. Form.C25H34N4O2
Mol. Mass.422.5631
SMILESCNc1ncc(\C=C2/C[C@H]3[C@@H]4CC[C@H]5N(C)C(=O)C=C[C@]5(C)[C@H]4CC[C@]3(C)[C@H]2O)cn1