Reaction Details
Target3-phosphoinositide-dependent protein kinase 1
LigandBDBM50296953
Substrate/Competitorn/a
Meas. Tech.ChEMBL_580930 (CHEMBL1054895)
Kd 5900±n/a nM
Citation Stroba, ASchaeffer, FHindie, VLopez-Garcia, LAdrian, IFröhner, WHartmann, RWBiondi, RMEngel, M 3,5-Diphenylpent-2-enoic acids as allosteric activators of the protein kinase PDK1: structure-activity relationships and thermodynamic characterization of binding as paradigms for PIF-binding pocket-targeting compounds. J Med Chem52:4683-93 (2009) 
 
3-phosphoinositide-dependent protein kinase 1
Name:3-phosphoinositide-dependent protein kinase 1
Type:Enzyme
Mol. Mass.:63157.65
Organism:Homo sapiens (Human)
Description:O15530
Residue:556
BDBM50296953
NameBDBM50296953
Synonyms:(Z)-5-(2,4-Dichlorophenyl)-3-phenylpent-2-enoic Acid | CHEMBL550195
TypeSmall organic molecule
Emp. Form.C17H14Cl2O2
Mol. Mass.321.198
SMILESOC(=O)\C=C(\CCc1ccc(Cl)cc1Cl)c1ccccc1