Reaction Details
TargetSteroid 17-alpha-hydroxylase/17,20 lyase
LigandBDBM50296971
Substrate/Competitorn/a
Meas. Tech.ChEMBL_580953 (CHEMBL1054918)
IC50 15930±n/a nM
Citation Ahmed, SShahid, IDhanani, SOwen, CP Synthesis and biochemical evaluation of a range of sulfonated derivatives of 4-hydroxybenzyl imidazole as highly potent inhibitors of rat testicular 17alpha-hydroxylase/17,20-lyase (P-450(17alpha)). Bioorg Med Chem Lett19:4698-701 (2009) 
 
Steroid 17-alpha-hydroxylase/17,20 lyase
Name:Steroid 17-alpha-hydroxylase/17,20 lyase
Type:Enzyme
Mol. Mass.:57255.68
Organism:Rattus norvegicus (Rat)
Description:P11715
Residue:507
BDBM50296971
NameBDBM50296971
Synonyms:4-((1H-imidazol-1-yl)methyl)phenyl 4-fluorobenzenesulfonate | CHEMBL560398
TypeSmall organic molecule
Emp. Form.C16H13FN2O3S
Mol. Mass.332.349
SMILESFc1ccc(cc1)S(=O)(=O)Oc1ccc(Cn2ccnc2)cc1