Reaction Details
TargetSteroid 17-alpha-hydroxylase/17,20 lyase
LigandBDBM50188092
Substrate/Competitorn/a
Meas. Tech.ChEMBL_580952 (CHEMBL1054917)
IC50 1580±n/a nM
Citation Ahmed, SShahid, IDhanani, SOwen, CP Synthesis and biochemical evaluation of a range of sulfonated derivatives of 4-hydroxybenzyl imidazole as highly potent inhibitors of rat testicular 17alpha-hydroxylase/17,20-lyase (P-450(17alpha)). Bioorg Med Chem Lett19:4698-701 (2009) 
 
Steroid 17-alpha-hydroxylase/17,20 lyase
Name:Steroid 17-alpha-hydroxylase/17,20 lyase
Type:Enzyme
Mol. Mass.:57255.68
Organism:Rattus norvegicus (Rat)
Description:P11715
Residue:507
BDBM50188092
NameBDBM50188092
Synonyms:1-(4-iodobenzyl)-1H-imidazole CHEMBL427399
TypeSmall organic molecule
Emp. Form.C10H9IN2
Mol. Mass.284.0963
SMILESIc1ccc(Cn2ccnc2)cc1