Reaction Details
TargetCyclin-dependent kinase 5
LigandBDBM50297039
Substrate/Competitorn/a
Meas. Tech.ChEMBL_580987 (CHEMBL1057275)
IC50 410±n/a nM
Citation Chioua, MSamadi, ASoriano, ELozach, OMeijer, LMarco-Contelles, J Synthesis and biological evaluation of 3,6-diamino-1H-pyrazolo[3,4-b]pyridine derivatives as protein kinase inhibitors. Bioorg Med Chem Lett19:4566-9 (2009) 
 
Cyclin-dependent kinase 5
Name:Cyclin-dependent kinase 5
Type:Enzyme Subunit
Mol. Mass.:33308.61
Organism:Homo sapiens (Human)
Description:n/a
Residue:292
BDBM50297039
NameBDBM50297039
Synonyms:3,6-diamino-4-phenyl-1H-pyrazolo[3,4-b]pyridine-5-carbonitrile | CHEMBL564921
TypeSmall organic molecule
Emp. Form.C13H10N6
Mol. Mass.250.2587
SMILESNc1n[nH]c2nc(N)c(C#N)c(-c3ccccc3)c12