Reaction Details
TargetSodium-dependent noradrenaline transporter
LigandBDBM50297077
Substrate/Competitorn/a
Meas. Tech.ChEMBL_581595 (CHEMBL1062482)
Ki 6±n/a nM
Citation Fish, PVWakenhut, FRyckmans, TStobie, A Design, synthesis and evaluation of N-[(3S)-pyrrolidin-3-yl]benzamides as selective noradrenaline reuptake inhibitors: CNS penetration in a more polar template. Bioorg Med Chem Lett19:4579-83 (2009) 
 
Sodium-dependent noradrenaline transporter
Name:Sodium-dependent noradrenaline transporter
Type:Multi-pass membrane protein
Mol. Mass.:69337.72
Organism:Homo sapiens (Human)
Description:P23975
Residue:617
BDBM50297077
NameBDBM50297077
Synonyms:(S)-N-(cyclobutylmethyl)-N-(pyrrolidin-3-yl)-2-(trifluoromethyl)benzamide PF-3409409
TypeSmall organic molecule
Emp. Form.C17H21F3N2O
Mol. Mass.326.3566
SMILESFC(F)(F)c1ccccc1C(=O)N(CC1CCC1)[C@H]1CCNC1