Reaction Details
TargetCyclin-dependent kinase 1
LigandBDBM50297120
Substrate/Competitorn/a
Meas. Tech.ChEMBL_581772 (CHEMBL1061559)
IC50 1±n/a nM
Citation Anderson, DRMeyers, MJKurumbail, RGCaspers, NPoda, GILong, SAPierce, BSMahoney, MWMourey, RJParikh, MD Benzothiophene inhibitors of MK2. Part 2: improvements in kinase selectivity and cell potency. Bioorg Med Chem Lett19:4882-4 (2009) 
 
Cyclin-dependent kinase 1
Name:Cyclin-dependent kinase 1
Type:Enzyme Subunit
Mol. Mass.:34101.08
Organism:Homo sapiens (Human)
Description:P06493
Residue:297
BDBM50297120
NameBDBM50297120
Synonyms:(R)-9-Methyl-8,9,10,11-tetrahydro-3-oxa-6-thia-8,11-diaza-cyclohepta[b]-as-indacen-7-one | CHEMBL557318
TypeSmall organic molecule
Emp. Form.C14H12N2O2S
Mol. Mass.272.322
SMILESC[C@@H]1CNc2c(sc3ccc4occc4c23)C(=O)N1