Reaction Details
TargetCollagenase 3
LigandBDBM28485
Substrate/Competitorn/a
Meas. Tech.ChEMBL_581466 (CHEMBL1055710)
IC50 2.4±n/a nM
Citation Li, WHu, YLi, JThomason, JRDeVincentis, DDu, XWu, JHotchandani, RRush, TSSkotnicki, JSTam, SChockalingam, PSMorris, EALevin, JI 3,4-Disubstituted benzofuran P1' MMP-13 inhibitors: optimization of selectivity and reduction of protein binding. Bioorg Med Chem Lett19:4546-50 (2009) 
 
Collagenase 3
Name:Collagenase 3
Type:Enzyme
Mol. Mass.:53808.06
Organism:Homo sapiens (Human)
Description:P45452
Residue:471
BDBM28485
NameBDBM28485
Synonyms:(2S)-2-({4-[4-(1-benzofuran-2-amido)phenyl]benzene}sulfonamido)-3-methylbutanoic acid benzofuran, 1
TypeSmall organic molecule
Emp. Form.C26H24N2O6S
Mol. Mass.492.544
SMILESCC(C)[C@H](NS(=O)(=O)c1ccc(cc1)-c1ccc(NC(=O)c2cc3ccccc3o2)cc1)C(O)=O