Reaction Details
TargetReplicase polyprotein 1ab
LigandBDBM50297252
Substrate/Competitorn/a
Meas. Tech.ChEMBL_581484 (CHEMBL1057306)
IC50 4100±n/a nM
Citation Lee, CLee, JMLee, NRKim, DEJeong, YJChong, Y Investigation of the pharmacophore space of Severe Acute Respiratory Syndrome coronavirus (SARS-CoV) NTPase/helicase by dihydroxychromone derivatives. Bioorg Med Chem Lett19:4538-41 (2009) 
 
Replicase polyprotein 1ab
Name:Replicase polyprotein 1ab
Type:Protein
Mol. Mass.:790250.81
Organism:Human SARS coronavirus (SARS-CoV) (Severe acute respiratory syndrome coronavirus)
Description:P0C6X7
Residue:7073
BDBM50297252
NameBDBM50297252
Synonyms:7-(4-Chloro-benzyloxy)-2-(3,4-dihydroxy-phenyl)-3,5-dihydroxy-chromen-4-one | CHEMBL550256
TypeSmall organic molecule
Emp. Form.C22H15ClO7
Mol. Mass.426.803
SMILESOc1ccc(cc1O)-c1oc2cc(OCc3ccc(Cl)cc3)cc(O)c2c(=O)c1O