Reaction Details
TargetMu-type opioid receptor
LigandBDBM50297295
Substrate/Competitorn/a
Meas. Tech.ChEMBL_582957 (CHEMBL1055013)
Ki 20.2±n/a nM
Citation Balboni, GTrapella, CSasaki, YAmbo, AMarczak, EDLazarus, LHSalvadori, S Influence of the side chain next to C-terminal benzimidazole in opioid pseudopeptides containing the Dmt-Tic pharmacophore. J Med Chem52:5556-9 (2009) 
 
Mu-type opioid receptor
Name:Mu-type opioid receptor
Type:G Protein-Coupled Receptor (GPCR)
Mol. Mass.:44503.11
Organism:Rattus norvegicus (rat)
Description:Competition binding assays were carried out using membrane preparations from transfected HN9.10 cells that constitutively expressed the mu opioid receptor.
Residue:398
BDBM50297295
NameBDBM50297295
Synonyms:(S)-1H-benzo[d]imidazol-2-yl 2-((S)-2-((S)-2-amino-3-(4-hydroxyphenyl)propanoyl)-1,2,3,4-tetrahydroisoquinoline-3-carboxamido)-3-phenylpropanoate | CHEMBL554625
TypeSmall organic molecule
Emp. Form.C35H33N5O4
Mol. Mass.587.6676
SMILESN[C@@H](Cc1ccc(O)cc1)C(=O)N1Cc2ccccc2C[C@H]1C(=O)N[C@@H](Cc1ccccc1)C(=O)c1nc2ccccc2[nH]1