Reaction Details
TargetMu-type opioid receptor
LigandBDBM50297289
Substrate/Competitorn/a
Meas. Tech.ChEMBL_582961 (CHEMBL1055017)
IC50 39.7±n/a nM
Citation Balboni, GTrapella, CSasaki, YAmbo, AMarczak, EDLazarus, LHSalvadori, S Influence of the side chain next to C-terminal benzimidazole in opioid pseudopeptides containing the Dmt-Tic pharmacophore. J Med Chem52:5556-9 (2009) 
 
Mu-type opioid receptor
Name:Mu-type opioid receptor
Type:Enzyme Catalytic Domain
Mol. Mass.:11165.58
Organism:GUINEA PIG
Description:P97266
Residue:98
BDBM50297289
NameBDBM50297289
Synonyms:(S)-1H-benzo[d]imidazol-2-yl 6-amino-2-((S)-2-((S)-2-amino-3-(4-hydroxy-2,6-dimethylphenyl)propanoyl)-1,2,3,4-tetrahydroisoquinoline-3-carboxamido)hexanoate | CHEMBL538456
TypeSmall organic molecule
Emp. Form.C34H40N6O4
Mol. Mass.596.7192
SMILESCc1cc(O)cc(C)c1C[C@H](N)C(=O)N1Cc2ccccc2C[C@H]1C(=O)N[C@@H](CCCCN)C(=O)c1nc2ccccc2[nH]1