Reaction Details
TargetMu-type opioid receptor
LigandBDBM50297301
Substrate/Competitorn/a
Meas. Tech.ChEMBL_582961 (CHEMBL1055017)
IC50 7.84±n/a nM
Citation Balboni, GTrapella, CSasaki, YAmbo, AMarczak, EDLazarus, LHSalvadori, S Influence of the side chain next to C-terminal benzimidazole in opioid pseudopeptides containing the Dmt-Tic pharmacophore. J Med Chem52:5556-9 (2009) 
 
Mu-type opioid receptor
Name:Mu-type opioid receptor
Type:Enzyme Catalytic Domain
Mol. Mass.:11165.58
Organism:GUINEA PIG
Description:P97266
Residue:98
BDBM50297301
NameBDBM50297301
Synonyms:(S)-1H-benzo[d]imidazol-2-yl 3-acetoxy-2-((S)-2-((S)-2-amino-3-(4-hydroxy-2,6-dimethylphenyl)propanoyl)-1,2,3,4-tetrahydroisoquinoline-3-carboxamido)propanoate | CHEMBL557346
TypeSmall organic molecule
Emp. Form.C33H35N5O6
Mol. Mass.597.6609
SMILESCC(=O)OC[C@H](NC(=O)[C@@H]1Cc2ccccc2CN1C(=O)[C@@H](N)Cc1c(C)cc(O)cc1C)C(=O)c1nc2ccccc2[nH]1