Reaction Details
TargetCytochrome P450 2D6
LigandBDBM50297304
Substrate/Competitorn/a
Meas. Tech.ChEMBL_582987 (CHEMBL1051825)
IC50 300±n/a nM
Citation Moree, WJLi, BFJovic, FCoon, TYu, JGross, RSTucci, FMarinkovic, DZamani-Kord, SMalany, SBradbury, MJHernandez, LMO'Brien, ZWen, JWang, HHoare, SRPetroski, RESacaan, AMadan, ACrowe, PDBeaton, G Characterization of novel selective H1-antihistamines for clinical evaluation in the treatment of insomnia. J Med Chem52:5307-10 (2009) 
 
Cytochrome P450 2D6
Name:Cytochrome P450 2D6
Type:Protein
Mol. Mass.:55774.82
Organism:Homo sapiens (Human)
Description:P10635
Residue:497
BDBM50297304
NameBDBM50297304
Synonyms:CHEMBL560741 | {2-[3-(4-Fluoro-benzyl)-1H-inden-2-yl]-ethyl}-dimethyl-amine
TypeSmall organic molecule
Emp. Form.C20H22FN
Mol. Mass.295.3938
SMILESCN(C)CCC1=C(Cc2ccc(F)cc2)c2ccccc2C1