Reaction Details
TargetMuscarinic acetylcholine receptor M1
LigandBDBM50297307
Substrate/Competitorn/a
Meas. Tech.ChEMBL_582982 (CHEMBL1051820)
Ki 2.4±n/a nM
Citation Moree, WJLi, BFJovic, FCoon, TYu, JGross, RSTucci, FMarinkovic, DZamani-Kord, SMalany, SBradbury, MJHernandez, LMO'Brien, ZWen, JWang, HHoare, SRPetroski, RESacaan, AMadan, ACrowe, PDBeaton, G Characterization of novel selective H1-antihistamines for clinical evaluation in the treatment of insomnia. J Med Chem52:5307-10 (2009) 
 
Muscarinic acetylcholine receptor M1
Name:Muscarinic acetylcholine receptor M1
Type:Protein
Mol. Mass.:51442.54
Organism:Homo sapiens (Human)
Description:P11229
Residue:460
BDBM50297307
NameBDBM50297307
Synonyms:CHEMBL564226 | R-dimethindene
TypeSmall organic molecule
Emp. Form.C20H24N2
Mol. Mass.292.418
SMILESC[C@H](C1=C(CCN(C)C)Cc2ccccc12)c1ccccn1