Reaction Details
TargetDelta-type opioid receptor
LigandBDBM50297335
Substrate/Competitorn/a
Meas. Tech.ChEMBL_583045 (CHEMBL1056544)
EC50 270±n/a nM
Citation Le Bourdonnec, BWindh, RTLeister, LKZhou, QJAjello, CWGu, MChu, GHTuthill, PABarker, WMKoblish, MWiant, DDGraczyk, TMBelanger, SCassel, JAFeschenko, MSBrogdon, BLSmith, SADerelanko, MJKutz, SLittle, PJDeHaven, RNDeHaven-Hudkins, DLDolle, RE Spirocyclic delta opioid receptor agonists for the treatment of pain: discovery of N,N-diethyl-3-hydroxy-4-(spiro[chromene-2,4'-piperidine]-4-yl) benzamide (ADL5747). J Med Chem52:5685-702 (2009) 
 
Delta-type opioid receptor
Name:Delta-type opioid receptor
Type:G Protein-Coupled Receptor (GPCR)
Mol. Mass.:40382.98
Organism:Homo sapiens (Human)
Description:Competition binding assays were carried out using membrane preparations from transfected HN9.10 cells that constitutively expressed the delta opioid receptor.
Residue:372
BDBM50297335
NameBDBM50297335
Synonyms:CHEMBL561138 | N,N-Diethyl-6-(spiro[chromene-2,4'-piperidine]-4-yl)nicotinamide
TypeSmall organic molecule
Emp. Form.C23H27N3O2
Mol. Mass.377.4794
SMILESCCN(CC)C(=O)c1ccc(nc1)C1=CC2(CCNCC2)Oc2ccccc12