Reaction Details
TargetMu-type opioid receptor
LigandBDBM50297340
Substrate/Competitorn/a
Meas. Tech.ChEMBL_583046 (CHEMBL1056545)
Ki 3400±n/a nM
Citation Le Bourdonnec, BWindh, RTLeister, LKZhou, QJAjello, CWGu, MChu, GHTuthill, PABarker, WMKoblish, MWiant, DDGraczyk, TMBelanger, SCassel, JAFeschenko, MSBrogdon, BLSmith, SADerelanko, MJKutz, SLittle, PJDeHaven, RNDeHaven-Hudkins, DLDolle, RE Spirocyclic delta opioid receptor agonists for the treatment of pain: discovery of N,N-diethyl-3-hydroxy-4-(spiro[chromene-2,4'-piperidine]-4-yl) benzamide (ADL5747). J Med Chem52:5685-702 (2009) 
 
Mu-type opioid receptor
Name:Mu-type opioid receptor
Type:G Protein-Coupled Receptor (GPCR)
Mol. Mass.:44789.51
Organism:Homo sapiens (Human)
Description:P35372
Residue:400
BDBM50297340
NameBDBM50297340
Synonyms:CHEMBL562478 | N,N-Diethyl-3-methyl-4-(spiro[chromene-2,4'-piperidine]-4-yl)-benzamide
TypeSmall organic molecule
Emp. Form.C25H30N2O2
Mol. Mass.390.5179
SMILESCCN(CC)C(=O)c1ccc(C2=CC3(CCNCC3)Oc3ccccc23)c(C)c1