Reaction Details
TargetKappa-type opioid receptor
LigandBDBM50297312
Substrate/Competitorn/a
Meas. Tech.ChEMBL_583048 (CHEMBL1056547)
Ki 800±n/a nM
Citation Le Bourdonnec, BWindh, RTLeister, LKZhou, QJAjello, CWGu, MChu, GHTuthill, PABarker, WMKoblish, MWiant, DDGraczyk, TMBelanger, SCassel, JAFeschenko, MSBrogdon, BLSmith, SADerelanko, MJKutz, SLittle, PJDeHaven, RNDeHaven-Hudkins, DLDolle, RE Spirocyclic delta opioid receptor agonists for the treatment of pain: discovery of N,N-diethyl-3-hydroxy-4-(spiro[chromene-2,4'-piperidine]-4-yl) benzamide (ADL5747). J Med Chem52:5685-702 (2009) 
 
Kappa-type opioid receptor
Name:Kappa-type opioid receptor
Type:G Protein-Coupled Receptor (GPCR)
Mol. Mass.:42648.76
Organism:Homo sapiens (Human)
Description:P41145
Residue:380
BDBM50297312
NameBDBM50297312
Synonyms:CHEMBL551412 | N-Ethyl-4-(spiro[chromene-2,4'-piperidine]-4-yl)benzamide
TypeSmall organic molecule
Emp. Form.C22H24N2O2
Mol. Mass.348.4382
SMILESCCNC(=O)c1ccc(cc1)C1=CC2(CCNCC2)Oc2ccccc12