Reaction Details
TargetPotassium voltage-gated channel subfamily H member 2
LigandBDBM50297325
Substrate/Competitorn/a
Meas. Tech.ChEMBL_583051 (CHEMBL1056550)
IC50 6429±n/a nM
Citation Le Bourdonnec, BWindh, RTLeister, LKZhou, QJAjello, CWGu, MChu, GHTuthill, PABarker, WMKoblish, MWiant, DDGraczyk, TMBelanger, SCassel, JAFeschenko, MSBrogdon, BLSmith, SADerelanko, MJKutz, SLittle, PJDeHaven, RNDeHaven-Hudkins, DLDolle, RE Spirocyclic delta opioid receptor agonists for the treatment of pain: discovery of N,N-diethyl-3-hydroxy-4-(spiro[chromene-2,4'-piperidine]-4-yl) benzamide (ADL5747). J Med Chem52:5685-702 (2009) 
 
Potassium voltage-gated channel subfamily H member 2
Name:Potassium voltage-gated channel subfamily H member 2
Type:Multi-pass membrane protein
Mol. Mass.:126672.65
Organism:Homo sapiens (Human)
Description:Q12809
Residue:1159
BDBM50297325
NameBDBM50297325
Synonyms:CHEMBL556439 | N,N-Diethyl-4-(spiro[chromene-2,3'-pyrrolidine]-4-yl)benzamide
TypeSmall organic molecule
Emp. Form.C23H26N2O2
Mol. Mass.362.4647
SMILESCCN(CC)C(=O)c1ccc(cc1)C1=CC2(CCNC2)Oc2ccccc12