Reaction Details
TargetCytochrome P450 2D6
LigandBDBM50252876
Substrate/Competitorn/a
Meas. Tech.ChEMBL_583050 (CHEMBL1056549)
IC50 4300±n/a nM
Citation Le Bourdonnec, BWindh, RTLeister, LKZhou, QJAjello, CWGu, MChu, GHTuthill, PABarker, WMKoblish, MWiant, DDGraczyk, TMBelanger, SCassel, JAFeschenko, MSBrogdon, BLSmith, SADerelanko, MJKutz, SLittle, PJDeHaven, RNDeHaven-Hudkins, DLDolle, RE Spirocyclic delta opioid receptor agonists for the treatment of pain: discovery of N,N-diethyl-3-hydroxy-4-(spiro[chromene-2,4'-piperidine]-4-yl) benzamide (ADL5747). J Med Chem52:5685-702 (2009) 
 
Cytochrome P450 2D6
Name:Cytochrome P450 2D6
Type:Protein
Mol. Mass.:55774.82
Organism:Homo sapiens (Human)
Description:P10635
Residue:497
BDBM50252876
NameBDBM50252876
Synonyms:CHEMBL494462 | N,N-Diethyl-4-(spiro[chromene-2,4'-piperidine]-4-yl)benzamide
TypeSmall organic molecule
Emp. Form.C24H28N2O2
Mol. Mass.376.4913
SMILESCCN(CC)C(=O)c1ccc(cc1)C1=CC2(CCNCC2)Oc2ccccc12