Reaction Details
TargetMu-type opioid receptor
LigandBDBM50297343
Substrate/Competitorn/a
Meas. Tech.ChEMBL_583147 (CHEMBL1062526)
Ki 763±n/a nM
Citation Fang, WJCui, YMurray, TFAldrich, JV Design, synthesis, and pharmacological activities of dynorphin A analogues cyclized by ring-closing metathesis. J Med Chem52:5619-25 (2009) 
 
Mu-type opioid receptor
Name:Mu-type opioid receptor
Type:G Protein-Coupled Receptor (GPCR)
Mol. Mass.:44503.11
Organism:Rattus norvegicus (rat)
Description:Competition binding assays were carried out using membrane preparations from transfected HN9.10 cells that constitutively expressed the mu opioid receptor.
Residue:398
BDBM50297343
NameBDBM50297343
Synonyms:(5S,8S,13S,Z)-13-((S)-2-amino-3-(4-hydroxyphenyl)propanamido)-5-benzyl-N-((6S,9S,12S,15S)-1,20-diamino-9-sec-butyl-6-((S)-2-((S)-1,6-diamino-1-oxohexan-2-ylcarbamoyl)pyrrolidine-1-carbonyl)-12-(3-guanidinopropyl)-1,20-diimino-8,11,14-trioxo-2,7,10,13,19-pentaazaicosan-15-yl)-3,6,14-trioxo-1,4,7-triazacyclotetradec-10-ene-8-carboxamide | CHEMBL553657
TypeSmall organic molecule
Emp. Form.C63H100N22O12
Mol. Mass.1357.6083
SMILESCC[C@H](C)[C@H](NC(=O)[C@H](CCCNC(N)=N)NC(=O)[C@H](CCCNC(N)=N)NC(=O)[C@@H]1CC=CC[C@H](NC(=O)[C@@H](N)Cc2ccc(O)cc2)C(=O)NCC(=O)N[C@@H](Cc2ccccc2)C(=O)N1)C(=O)N[C@@H](CCCNC(N)=N)C(=O)N1CCC[C@H]1C(=O)N[C@@H](CCCCN)C(N)=O