Reaction Details
TargetDelta-type opioid receptor
LigandBDBM50297347
Substrate/Competitorn/a
Meas. Tech.ChEMBL_583148 (CHEMBL1062527)
Ki 1210±n/a nM
Citation Fang, WJCui, YMurray, TFAldrich, JV Design, synthesis, and pharmacological activities of dynorphin A analogues cyclized by ring-closing metathesis. J Med Chem52:5619-25 (2009) 
 
Delta-type opioid receptor
Name:Delta-type opioid receptor
Type:Enzyme Catalytic Domain
Mol. Mass.:40577.25
Organism:MOUSE
Description:P32300
Residue:372
BDBM50297347
NameBDBM50297347
Synonyms:(2S,5S,8S,13S,Z)-13-((S)-2-(2-(2-((S)-2-amino-3-(4-hydroxyphenyl)propanamido)acetamido)acetamido)-3-phenylpropanamido)-N-((S)-1-((S)-2-((S)-1,6-diamino-1-oxohexan-2-ylcarbamoyl)pyrrolidin-1-yl)-5-guanidino-1-oxopentan-2-yl)-2,5-bis(3-guanidinopropyl)-3,6,14-trioxo-1,4,7-triazacyclotetradec-10-ene-8-carboxamide CHEMBL564095
TypeSmall organic molecule
Emp. Form.C59H92N22O12
Mol. Mass.1301.502
SMILES[#7]-[#6]-[#6]-[#6]-[#6]-[#6@H](-[#7]-[#6](=O)-[#6@@H]-1-[#6]-[#6]-[#6]-[#7]-1-[#6](=O)-[#6@H](-[#6]-[#6]-[#6]\[#7]=[#6](/[#7])-[#7])-[#7]-[#6](=O)-[#6@@H]-1-[#6]-[#6]=[#6]-[#6]-[#6@H](-[#7]-[#6](=O)-[#6@H](-[#6]-c2ccccc2)-[#7]-[#6](=O)-[#6]-[#7]-[#6](=O)-[#6]-[#7]-[#6](=O)-[#6@@H](-[#7])-[#6]-c2ccc(-[#8])cc2)-[#6](=O)-[#7]-[#6@@H](-[#6]-[#6]-[#6]\[#7]=[#6](\[#7])-[#7])-[#6](=O)-[#7]-[#6@@H](-[#6]-[#6]-[#6]\[#7]=[#6](\[#7])-[#7])-[#6](=O)-[#7]-1)-[#6](-[#7])=O