Reaction Details
TargetHistamine H3 receptor
LigandBDBM50297366
Substrate/Competitorn/a
Meas. Tech.ChEMBL_583253 (CHEMBL1055808)
Ki 1±n/a nM
Citation Covel, JASantora, VJSmith, JMHayashi, RGallardo, CWeinhouse, MIIbarra, JBSchultz, JAPark, DMEstrada, SAHofilena, BJPulley, MDSmith, BMRen, ASuarez, MFrazer, JEdwards, JHauser, EKLorea, JSemple, GGrottick, AJ Design and evaluation of novel biphenyl sulfonamide derivatives with potent histamine H(3) receptor inverse agonist activity. J Med Chem52:5603-11 (2009) 
 
Histamine H3 receptor
Name:Histamine H3 receptor
Type:G Protein-Coupled Receptor (GPCR)
Mol. Mass.:48691.47
Organism:Homo sapiens (Human)
Description:Binding assays were using CHO cells stably expressing hH3R receptors.
Residue:445
BDBM50297366
NameBDBM50297366
Synonyms:4'-[2-((R)-2-Methyl-pyrrolidin-1-yl)-ethyl]-biphenyl-4-sulfonic Acid Ethylamide | CHEMBL569832
TypeSmall organic molecule
Emp. Form.C21H28N2O2S
Mol. Mass.372.524
SMILESCCNS(=O)(=O)c1ccc(cc1)-c1ccc(CCN2CCC[C@H]2C)cc1