Reaction Details
TargetCytochrome P450 2C9
LigandBDBM50080250
Substrate/Competitorn/a
Meas. Tech.ChEMBL_583358 (CHEMBL1053351)
IC50 1±n/a nM
Citation Hutchinson, JHLi, YArruda, JMBaccei, CBain, GChapman, CCorrea, LDarlington, JKing, CDLee, CLorrain, DProdanovich, PRong, HSantini, AStock, NPrasit, PEvans, JF 5-lipoxygenase-activating protein inhibitors: development of 3-[3-tert-butylsulfanyl-1-[4-(6-methoxy-pyridin-3-yl)-benzyl]-5-(pyridin-2-ylmethoxy)-1H-indol-2-yl]-2,2-dimethyl-propionic acid (AM103). J Med Chem52:5803-15 (2009) 
 
Cytochrome P450 2C9
Name:Cytochrome P450 2C9
Type:Enzyme
Mol. Mass.:55636.33
Organism:Homo sapiens (Human)
Description:P11712
Residue:490
BDBM50080250
NameBDBM50080250
Synonyms:3-(3-(tert-butylthio)-1-(4-chlorobenzyl)-5-(pyridin-2-ylmethoxy)-1H-indol-2-yl)-2,2-dimethylpropanoic acid CHEMBL38958
TypeSmall organic molecule
Emp. Form.C30H33ClN2O3S
Mol. Mass.537.113
SMILESCC(C)(C)Sc1c(CC(C)(C)C(O)=O)n(Cc2ccc(Cl)cc2)c2ccc(OCc3ccccn3)cc12