Reaction Details
TargetSodium-dependent serotonin transporter
LigandBDBM50297420
Substrate/Competitorn/a
Meas. Tech.ChEMBL_582828 (CHEMBL1061664)
Ki 2.1±n/a nM
Citation White, JDJuniku, RHuang, KYang, JWong, DT Synthesis of 1,1-[1-naphthyloxy-2-thiophenyl]-2-methylaminomethylcyclopropanes and their evaluation as inhibitors of serotonin, norepinephrine, and dopamine transporters. J Med Chem52:5872-9 (2009) 
 
Sodium-dependent serotonin transporter
Name:Sodium-dependent serotonin transporter
Type:Multi-pass membrane protein
Mol. Mass.:70322.51
Organism:Homo sapiens (Human)
Description:P31645
Residue:630
BDBM50297420
NameBDBM50297420
Synonyms:(Z)-N-Methyl-2-(naphthalen-1-yloxy)-2-(thiophen-2-yl)cyclopropyl)methanamine Hydrochloride N-methyl-1-((1S,2S)-2-(naphthalen-1-yloxy)-2-(thiophen-2-yl)cyclopropyl)methanamine hydrochloride
TypeSmall organic molecule
Emp. Form.C19H19NOS
Mol. Mass.309.425
SMILESCNC[C@@H]1C[C@@]1(Oc1cccc2ccccc12)c1cccs1