Reaction Details
TargetHistone deacetylase 3
LigandBDBM50297447
Substrate/Competitorn/a
Meas. Tech.ChEMBL_585886 (CHEMBL1053557)
IC50 440.00±n/a nM
Citation Giannini, GMarzi, MMarzo, MDBattistuzzi, GPezzi, RBrunetti, TCabri, WVesci, LPisano, C Exploring bis-(indolyl)methane moiety as an alternative and innovative CAP group in the design of histone deacetylase (HDAC) inhibitors. Bioorg Med Chem Lett19:2840-3 (2009) 
 
Histone deacetylase 3
Name:Histone deacetylase 3
Type:Enzyme
Mol. Mass.:48829.55
Organism:Homo sapiens (Human)
Description:O15379
Residue:428
BDBM50297447
NameBDBM50297447
Synonyms:3-(4-(di(1H-indol-3-yl)methyl)phenyl)-N-hydroxyacrylamide ST-2887
TypeSmall organic molecule
Emp. Form.C26H21N3O2
Mol. Mass.407.4638
SMILESONC(=O)\C=C\c1ccc(cc1)C(c1c[nH]c2ccccc12)c1c[nH]c2ccccc12