Reaction Details
TargetHistone deacetylase 4
LigandBDBM50297448
Substrate/Competitorn/a
Meas. Tech.ChEMBL_585887 (CHEMBL1053558)
IC50 150000.00±n/a nM
Citation Giannini, GMarzi, MMarzo, MDBattistuzzi, GPezzi, RBrunetti, TCabri, WVesci, LPisano, C Exploring bis-(indolyl)methane moiety as an alternative and innovative CAP group in the design of histone deacetylase (HDAC) inhibitors. Bioorg Med Chem Lett19:2840-3 (2009) 
 
Histone deacetylase 4
Name:Histone deacetylase 4
Type:Enzyme
Mol. Mass.:119049.39
Organism:Homo sapiens (Human)
Description:P56524
Residue:1084
BDBM50297448
NameBDBM50297448
Synonyms:CHEMBL564916 ST-3071
TypeSmall organic molecule
Emp. Form.C29H30N4O
Mol. Mass.450.5747
SMILESNc1ccccc1NC(=O)CCCCCC(c1c[nH]c2ccccc12)c1c[nH]c2ccccc12