Reaction Details
TargetHistone deacetylase 7
LigandBDBM50297445
Substrate/Competitorn/a
Meas. Tech.ChEMBL_585890 (CHEMBL1053561)
IC50 420.00±n/a nM
Citation Giannini, GMarzi, MMarzo, MDBattistuzzi, GPezzi, RBrunetti, TCabri, WVesci, LPisano, C Exploring bis-(indolyl)methane moiety as an alternative and innovative CAP group in the design of histone deacetylase (HDAC) inhibitors. Bioorg Med Chem Lett19:2840-3 (2009) 
 
Histone deacetylase 7
Name:Histone deacetylase 7
Type:Chromatin regulator; hydrolase; repressor
Mol. Mass.:102942.62
Organism:Homo sapiens (Human)
Description:Q8WUI4
Residue:952
BDBM50297445
NameBDBM50297445
Synonyms:CHEMBL561483 | N-hydroxy-7,7-bis(7-methoxy-1H-indol-3-yl)heptanamide
TypeSmall organic molecule
Emp. Form.C25H29N3O4
Mol. Mass.435.5155
SMILESCOc1cccc2c(c[nH]c12)C(CCCCCC(=O)NO)c1c[nH]c2c(OC)cccc12