Reaction Details
TargetHistone deacetylase 7
LigandBDBM50297446
Substrate/Competitorn/a
Meas. Tech.ChEMBL_585890 (CHEMBL1053561)
IC50 220.00±n/a nM
Citation Giannini, GMarzi, MMarzo, MDBattistuzzi, GPezzi, RBrunetti, TCabri, WVesci, LPisano, C Exploring bis-(indolyl)methane moiety as an alternative and innovative CAP group in the design of histone deacetylase (HDAC) inhibitors. Bioorg Med Chem Lett19:2840-3 (2009) 
 
Histone deacetylase 7
Name:Histone deacetylase 7
Type:Chromatin regulator; hydrolase; repressor
Mol. Mass.:102942.62
Organism:Homo sapiens (Human)
Description:Q8WUI4
Residue:952
BDBM50297446
NameBDBM50297446
Synonyms:CHEMBL561604 ST-5732
TypeSmall organic molecule
Emp. Form.C23H23N5O6
Mol. Mass.465.4586
SMILESONC(=O)CCCCCC(c1c[nH]c2ccc(cc12)[N+]([O-])=O)c1c[nH]c2ccc(cc12)[N+]([O-])=O