Reaction Details
TargetHistone deacetylase 7
LigandBDBM50297447
Substrate/Competitorn/a
Meas. Tech.ChEMBL_585890 (CHEMBL1053561)
IC50 4200.00±n/a nM
Citation Giannini, GMarzi, MMarzo, MDBattistuzzi, GPezzi, RBrunetti, TCabri, WVesci, LPisano, C Exploring bis-(indolyl)methane moiety as an alternative and innovative CAP group in the design of histone deacetylase (HDAC) inhibitors. Bioorg Med Chem Lett19:2840-3 (2009) 
 
Histone deacetylase 7
Name:Histone deacetylase 7
Type:Chromatin regulator; hydrolase; repressor
Mol. Mass.:102942.62
Organism:Homo sapiens (Human)
Description:Q8WUI4
Residue:952
BDBM50297447
NameBDBM50297447
Synonyms:3-(4-(di(1H-indol-3-yl)methyl)phenyl)-N-hydroxyacrylamide ST-2887
TypeSmall organic molecule
Emp. Form.C26H21N3O2
Mol. Mass.407.4638
SMILESONC(=O)\C=C\c1ccc(cc1)C(c1c[nH]c2ccccc12)c1c[nH]c2ccccc12