Reaction Details
TargetHistone deacetylase 8
LigandBDBM50297444
Substrate/Competitorn/a
Meas. Tech.ChEMBL_585891 (CHEMBL1053562)
IC50 240.00±n/a nM
Citation Giannini, GMarzi, MMarzo, MDBattistuzzi, GPezzi, RBrunetti, TCabri, WVesci, LPisano, C Exploring bis-(indolyl)methane moiety as an alternative and innovative CAP group in the design of histone deacetylase (HDAC) inhibitors. Bioorg Med Chem Lett19:2840-3 (2009) 
 
Histone deacetylase 8
Name:Histone deacetylase 8
Type:Enzyme
Mol. Mass.:41749.60
Organism:Homo sapiens (Human)
Description:Q9BY41
Residue:377
BDBM50297444
NameBDBM50297444
Synonyms:CHEMBL564876 ST-2741
TypeSmall organic molecule
Emp. Form.C23H25N3O2
Mol. Mass.375.4635
SMILESONC(=O)CCCCCC(c1c[nH]c2ccccc12)c1c[nH]c2ccccc12